CR NO.,AGE,GENDER,SAMPLE,ICU LENGTH (DAYS),VENTILATION DAYS,DM,CKD,IMMUNOSUPPRESSION,HTN,MALIGNANCY,POST OP,CHRONIC RESP,PCT (ng/ml),D-DIMER,FDP,S. FERRITIN (ng/ml),TLC,OUTCOME,BLOOD CX,ORGANISMS,ELORES,XDR,MDR,mvornot,VENTILATION DAYS.1,MDS,CT,AK,CA,CI,CF,CFS,IMI,MERO,ERTA,ATM,TZP,COTRI,LE,AS,AMP,CC,E,DOXY,V,T,MINO,LINEZOLIDE,CHLORAM,NAME
20191189364,22,MALE,ET ASPIRATE,0,0,NO,NO,NO,NO,YES,YES,YES,,,,,10700,ALIVE,"MRSA, s/t  V,T",MRCONS,,NO,YES,NMV,0,NO,,,,,,,,,,,,,R,R,R,R,R,R,S,S,,,,VIKAS RAM
2003153551,79,MALE,SPUTUM,7,3,NO,NO,NO,YES,NO,NO,YES,0.02,,,,7600,ALIVE,NEGATIVE,Pseudomonas spp,,NO,YES,MV,3,NO,"S, 2",R,R,,,R,R,R,,R,S,S,R,,,,,,,,,,,MM CHAUDHARY
2020552093,63,MALE,SPUTUM,0,0,NO,NO,NO,YES,NO,NO,NO,,,,,8600,ALIVE,NEGATIVE,E. coli,,NO,NO,NMV,0,YES,,S,R,R,R,R,S,S,S,,,,,,,,,,,,R,,,RAVI SRIVASTAVA
2020470793,75,MALE,ET ASPIRATE,22,18,YES,NO,NO,YES,NO,NO,NO,8.92,NEGATIVE,POSITIVE,8655,9380,DEAD,NEGATIVE,A. baumanii,R,NO,YES,MV,18,NO,"S, 0.5",R,R,R,R,R,R,R,,,,,,,,,,,,,R,,,JITENDRA SRIVASTAVA
2020538828,63,FEMALE,ET ASPIRATE,27,16,NO,NO,NO,YES,NO,NO,YES,0.92,NEGATIVE,POSITIVE,569,17100,DEAD,"MRSA, s/t  V,T, Doxy, AK, CC",A. baumanii,R,NO,YES,MV,16,NO,"S, 0.5",R,R,R,R,R,R,R,,,,,,,,,,,,,R,,,MEDHAWATI
2020566374,75,MALE,ET ASPIRATE,25,14,NO,YES,NO,YES,NO,NO,YES,3.69,POSITIVE,POSITIVE,2386.18,43900,DEAD,NEGATIVE,A. baumanii,S,NO,YES,MV,14,NO,"S, 0.38",R,R,R,R,R,R,R,,,,,,,,,,,,,R,,,NAURANG BAHADUR
2020573258,80,MALE,ET ASPIRATE,15,10,NO,NO,NO,YES,NO,YES,NO,0.24,POSITIVE,POSITIVE,,8600,ALIVE,NEGATIVE,A. baumanii,S,NO,YES,MV,10,NO,"S, 0.38",R,R,R,R,R,R,R,,,,,,,,,,,,,R,,,GORAK NATH PANDEY
2014518843,45,MALE,ET ASPIRATE,62,55,YES,YES,NO,YES,NO,NO,YES,10.87,,,> 2000,13400,DEAD,NEGATIVE,A. baumanii,R,NO,YES,MV,55,NO,"S, 2",R,R,R,R,R,R,R,,,,,,,,,,,,,R,,,V K YADAV
2020521055,62,MALE,ET ASPIRATE,50,25,NO,NO,NO,NO,NO,NO,NO,2.3,"POSITIVE, 0.68",POSITIVE,1446.23,12000,DEAD,NEGATIVE,Pseudomonas aeruginosa,,NO,YES,MV,25,NO,"S, 1.5",R,R,,,R,R,R,,R,R,,R,,,,,,,,,,,HANUMAT PRASAD
2011328837,66,MALE,ET ASPIRATE,20,10,YES,YES,NO,NO,NO,NO,YES,0.62,"POSITIVE, 1,29",POSITIVE,312.15,10400,DEAD,NEGATIVE,A. baumanii,R,YES,NO,MV,10,NO,R,R,R,R,R,R,R,R,,,,,,,,,,,,,R,,,DILIP KR TRIPATHI
2017014420,33,MALE,ET ASPIRATE,23,12,NO,NO,NO,NO,NO,NO,YES,0.88,"POSITIVE, 3.34",POSITIVE,1550.42,13100,DEAD,"MRSA, s/t V, T, Doxy",Pseudomonas aeruginosa,,NO,YES,MV,12,NO,"S, 1",R,R,,,R,R,R,,R,R,,R,,,,,,,,,,,RAJ KUMAR JAGRANI
2020498110,27,MALE,ET ASPIRATE,20,15,NO,NO,NO,NO,NO,NO,YES,0.1,"POSITIVE, 1.65",POSITIVE,934.91,12000,ALIVE,NEGATIVE,A. baumanii,S,NO,YES,MV,15,NO,"S, 0.5",R,R,R,R,R,R,R,,,,,,,,,,,,,S,,,HARI OM TIWARI
2020434123,53,FEMALE,ET ASPIRATE,20,8,NO,NO,NO,NO,NO,YES,YES,0.16,"NEGATIVE, 0.02",POSITIVE,580,8200,DEAD,NEGATIVE,A. baumanii,S,NO,YES,MV,8,NO,"S, 0.75",R,R,R,R,R,R,R,,,,,,,,,,,,,S,,,MAMTA MALVIYA
2020435103,45,FEMALE,ET ASPIRATE,29,15,NO,NO,NO,NO,NO,NO,YES,0.68,"POSITIVE, 8.17",POSITIVE,690.68,11800,ALIVE,NEGATIVE,Stenotrophomonas maltophilia,,NO,NO,MV,15,YES,,,R,,,,,,,,,S,S,,,,,,,,S,,S,JOSLY
2020399458,22,FEMALE,THROAT SWAB,0,0,NO,NO,NO,YES,NO,NO,YES,3.97,"POSITIVE, 2.51",POSITIVE,2632.14,2500,ALIVE,"Pseudo aero s/t CT (1.5), ATM, TZP",E. coli,R,NO,YES,NMV,0,NO,"S, 0.5",R,R,R,R,R,R,R,R,,,,,,,,,,,,R,,,URMILA DEVI
2021316167,38,FEMALE,ET ASPIRATE,3,3,NO,NO,NO,NO,NO,YES,YES,2.21,"NEGATIVE, 0.03",NEGATIVE,1872,1800,DEAD,NEGATIVE,Stenotrophomonas maltophilia,,NO,NO,MV,3,YES,,,R,,,,,R,,,,S,S,,,,,,,,,,R,NISHU SINGH
2016555133,65,FEMALE,SPUTUM,70,8,NO,YES,NO,YES,NO,NO,YES,0.17,"POSITIVE, 2.47",POSITIVE,895,9900,DEAD,Pseudo aero s/t CT (2),Pseudomonas aeruginosa,,NO,NO,MV,8,YES,"S, 2",S,S,,,S,S,R,,S,S,R,R,,,,,,,,,,,CHANDA RANI JAISWAL
2005130109,56,MALE,ET ASPIRATE,30,3,NO,NO,NO,NO,NO,NO,YES,0.36,"POSITIVE, 2.17",POSITIVE,675.02,15100,ALIVE,"Enterococcus faecalis s/t Lz, Mino",K. pneumonniae,R,NO,YES,MV,3,NO,"S, 0.38",R,R,R,R,R,R,R,R,,,,,,,,,,,,MS,,,HARI BAX SINGH
2020519343,48,MALE,SPUTUM,20,18,NO,YES,NO,YES,NO,NO,NO,0.06,"POSITIVE, 0.55",POSITIVE,,13400,DEAD,Pseudo aero s/t CT (2),Pseudomonas aeruginosa,,NO,YES,MV,18,NO,"S, 1.5",R,R,,,R,R,R,,R,R,,R,,,,,,,,R,,,PREM KUMAR PANDEY
2020480734,59,MALE,BAL,38,20,NO,YES,YES,NO,NO,NO,YES,0.02,"POSITIVE, 0.958",POSITIVE,293.53,11000,ALIVE,NEGATIVE,Pseudomonas aeruginosa,,YES,NO,MV,20,NO,R,R,R,,,R,R,R,,R,R,,R,,,,,,,,R,,,ARUN KUMAR SINGH
2020145750,45,FEMALE,SPUTUM,3,3,NO,NO,YES,NO,YES,NO,YES,1.85,,,,8300,DEAD,NEGATIVE,Pseudomonas aeruginosa,,NO,NO,MV,3,YES,"S, 1",S,MS,R,R,MS,S,S,,MS,MS,,S,,,,,,,,R,,,GAYATRI BAJPAYEE
2020603648,63,M,TT ASPIRATE,22,7,NO,NO,NO,NO,NO,NO,NO,4.81,"POSITIVE, 3.53",POSITIVE,6092.75,16000,DEAD,K. pneumoniae s/t ALL RESISTANT,K. pneumonniae,R,YES,NO,MV,7,NO,R,R,R,R,R,R,R,R,R,,,,,,,,,,,,R,,,HARI SHANKAR
2020539680,69,M,TT ASPIRATE,41,13,YES,NO,NO,YES,NO,NO,NO,0.03,"POSITIVE, 0.96",POSITIVE,865.23,13200,DEAD,NEGATIVE,Enterococcous faecium,,YES,NO,MV,13,NO,,,,,,,,,,,,,R,R,R,,,R,R,R,R,R,,JUSTICE V K DIXIT
2020419456,61,F,ET ASPIRATE,0,0,NO,NO,NO,YES,YES,YES,NO,7.01,,,,14400,ALIVE,"MRSA, s/t V, T, Doxy",K. pneumonniae,S,NO,YES,NMV,0,NO,"S, 2",R,R,R,R,R,R,R,R,,,,,,,,,,,,R,,,CHINTA DEVI
2018743703,45,M,TT ASPIRATE,10,7,NO,YES,NO,YES,NO,NO,YES,7.2,"POSITIVE, 2.86",POSITIVE,547.59,5300,DEAD,NEGATIVE,K. pneumonniae,R,YES,NO,MV,7,NO,R,R,R,R,R,R,R,R,R,,,,,,,,,,,,R,,,SANTOSH PATHAK
2021001782,86,M,SPUTUM,30,0,YES,NO,YES,YES,NO,NO,NO,0.22,"POSITIVE, 2.9 ",POSITIVE,1013.34,9300,ALIVE,NEGATIVE,K. pneumonniae,R,NO,YES,NMV,0,NO,"S, 0.38",R,R,R,R,R,R,R,R,,,,,,,,,,,,R,,,KESHRI NATH TRIPATHI
2020553238,50,F,SPUTUM,0,0,NO,YES,NO,NO,YES,NO,YES,0.08,"POSITIVE, 3.09",POSITIVE,2814,4010,ALIVE,NEGATIVE,K. pneumonniae,R,NO,YES,NMV,0,NO,"S, 0.38",R,R,R,R,R,R,R,R,,,,,,,,,,,,R,,,KRISHNA KUMARI
2021033983,19,M,SPUTUM,0,0,NO,NO,NO,NO,NO,YES,NO,29.12,"POSITIVE, 2.51",,,8400,ALIVE,NEGATIVE,K. pneumonniae,R,YES,NO,NMV,0,NO,R,R,R,R,R,R,R,R,R,,,,,,,,,,,,R,,,SARJEET
2020378082,78,M,TT ASPIRATE,0,0,NO,NO,NO,NO,YES,YES,NO,6.22,,,,20000,DEAD,"Enterococcus faecium s/t Lz, Mino, V, T, Doxy",K. pneumonniae,R,YES,NO,NMV,0,NO,R,R,R,R,R,R,R,R,R,,,,,,,,,,,,R,,,MALTI PRASAD
2019525802,49,M,SPUTUM,23,14,NO,NO,NO,YES,NO,NO,YES,0.92,"POSITIVE, 3.43",,,9500,ALIVE,NEGATIVE,K. pneumonniae,S,NO,NO,MV,14,YES,"S, 0.38",S,R,R,R,R,S,S,S,,,,,,,,,,,,R,,,MITHILESH KR. MISHRA
2014303408,73,M,SPUTUM,0,0,YES,NO,NO,YES,NO,NO,YES,0.11,"POSITIVE, 3.9",POSITIVE,171.6,10300,DEAD,NEGATIVE,E. coli,S,NO,YES,NMV,0,NO,"S, 0.38",R,R,R,R,R,R,R,R,,,,,,,,,,,,S,,,SIDESH CHANDRA PRASAD
2021248088,68,M,SPUTUM,0,0,NO,NO,NO,YES,NO,NO,YES,0.06,"POSITIVE, 2.45",POSITIVE,392.65,7700,ALIVE,NEGATIVE,A. baumanii,S,NO,YES,NMV,0,NO,"S, 0.5",R,R,R,R,R,R,R,,,,,,,,,,,,,S,,,ABHINANDAN SINGH
2021159993,37,M,NASAL SWAB,0,0,YES,NO,NO,YES,NO,YES,NO,0.04,,,,30100,ALIVE,NEGATIVE,Pseudomonas aeruginosa,,NO,NO,NMV,0,YES,,S,S,,,S,S,S,,S,S,,S,,,,,,,,,,,SUDHANSHU TIWARI
2021260593,76,M,TT ASPIRATE,7,4,NO,NO,YES,YES,NO,NO,YES,0.52,"POSITIVE, 3.87",POSITIVE,658,86400,DEAD,NEGATIVE,Stenotrophomonas maltophilia,,NO,NO,MV,4,YES,,,S,,,,,,,,,S,S,,,,,,,,S,,S,GIRRAJ DHARAN RASTOGI
2010348664,33,M,SPUTUM,0,0,NO,NO,YES,YES,NO,YES,NO,0.93,"POSITIVE, 2.66",,1866.71,12200,ALIVE,NEGATIVE,K. pneumonniae,R,NO,YES,NMV,0,NO,"S, 1.5",R,R,R,R,R,R,R,R,,,,,,,,,,,,S,,,AMIT MISHRA
2013498837,43,M,TT ASPIRATE,18,17,NO,NO,NO,NO,NO,NO,NO,5.17,"POSITIVE, 3.6",POSITIVE,4006.85,12500,DEAD,NEGATIVE,K. pneumonniae,R,NO,YES,MV,17,NO,"S, 2",R,R,R,R,R,R,R,R,,,,,,,,,,,,S,,,TRILOKI NATH SHUKLA
2021283372,60,M,SPUTUM,0,0,YES,YES,NO,YES,NO,YES,NO,0.05,"POSITIVE, 4.08",POSITIVE,1437.92,14200,ALIVE,NEGATIVE,Stenotrophomonas maltophilia,,NO,NO,NMV,0,YES,,,,,,S,,,,,,S,S,,,,,,,,S,,,DINESH CHANDRA
2021304337,51,M,SPUTUM,12,10,NO,NO,YES,NO,NO,NO,YES,0.08,"POSITIVE, 2.45",POSITIVE,542.91,15200,ALIVE,"MRCONS, s/t V, T",K. pneumonniae,R,NO,YES,MV,10,NO,"S, 0.5",R,R,R,R,R,R,R,R,,,,,,,,,,,,S,,,MIRZA AHMAD BEG
2021304445,69,M,ET ASPIRATE,1,1,YES,NO,NO,YES,NO,NO,YES,1.56,,,,11400,DEAD,"A. baumanii, s/t Ct, Tg",A. baumanii,R,NO,YES,MV,1,NO,"S, 0.38",R,R,R,R,R,R,R,R,,,,,,,,,,,,S,,,GAJRAJ
2021266108,52,M,TT ASPIRATE,18,7,YES,NO,NO,NO,NO,NO,YES,4.88,"POSITIVE, 2.65",POSITIVE,3272.02,11000,ALIVE,"MRCONS, s/t V, T, Lz",Pseudomonas aeruginosa,,NO,YES,MV,7,NO,"S, 0.5",R,R,,,R,R,R,,R,R,,R,,,,,,,,,,,PRABODH KUMAR TRIVEDI
2021285415,60,M,ET ASPIRATE,19,6,NO,YES,NO,YES,NO,NO,NO,19.71,"POSITIVE, 13.34",POSITIVE,4559,37500,DEAD,NEGATIVE,K. pneumonniae,R,NO,YES,MV,6,NO,"S, 2",R,R,R,R,R,R,R,R,,,,,,,,,,,,S,,,DEEPAK TRIVEDI
2021291633,66,M,ET ASPIRATE,7,5,YES,YES,YES,YES,NO,NO,NO,34.6,"POSITIVE, 3.43",POSITIVE,16622,20100,DEAD,NEGATIVE,A. baumanii,R,NO,YES,MV,5,NO,"S, 1",R,R,R,R,R,R,R,R,,,,,,,,,,,,S,,,PRABODH CHANDRA GUPTA
2020401254,37,M,ET ASPIRATE,12,8,NO,NO,NO,NO,NO,NO,YES,0.25,"POSITIVE, 3.42",POSITIVE,1824,8800,ALIVE,NEGATIVE,A. baumanii,R,NO,YES,MV,8,NO,"S, 2",R,R,R,R,R,R,R,R,,,,,,,,,,,,R,,,VIKAS CHANDRA
2014258532,74,M,SPUTUM,0,0,YES,YES,NO,YES,NO,NO,YES,0.16,"POSITIVE, 2.67",NEGATIVE,1061.95,7100,ALIVE,NEGATIVE,Pseudomonas mosselli,,NO,NO,NMV,0,YES,"S, 2",S,S,,,S,S,R,,R,S,,,,,,,,,,,,,RAM BILAS KANNAUJIYA
2020190291,18,F,SPUTUM,0,0,NO,NO,NO,NO,YES,NO,YES,7.29,POSITIVE. 2.89,,>2000.00,2000,DEAD,NEGATIVE,Serratia marsecens,,NO,NO,NMV,0,YES,,S,S,S,S,S,S,S,S,,,,,,,,,,,,,,,AKANKSHA KUMARI
2021296660,28,F,SPUTUM,16,14,YES,NO,NO,NO,NO,NO,YES,0.29,"POSITIVE, 3.988",POSITIVE,539,22700,ALIVE,"POS, Ochrobacterium intermedium",Ochrobacterium intermedium,,NO,NO,MV,14,YES,,R,R,R,R,R,S,S,R,,,S,S,,,,,,,,S,,,BHAVYA PRIYADARSHINI
2018437367,33,M,SPUTUM,0,0,NO,YES,YES,YES,NO,NO,NO,0.24,NEGATIVE,NEGATIVE,1874.92,8100,ALIVE,NEGATIVE,K. pneumonniae,R,YES,NO,NMV,0,NO,"R, 48",R,R,R,R,R,R,R,R,,,,,,,,,,,,R,,R,AMIT
2011376424,54,M,SPUTUM,0,0,NO,YES,YES,YES,NO,NO,YES,12.85,"POSITIVE, 2.45",POSITIVE,6623.27,16500,ALIVE,NEGATIVE,K. pneumonniae,R,NO,YES,NMV,0,NO,"S, 0.5",R,R,R,R,R,R,R,R,,,,,,,,,,,,MS,,,DALIP SINGH GUNJIYAL
2021322874,43,M,NASAL SWAB,0,0,YES,NO,NO,YES,NO,NO,NO,0.43,"POSITIVE, 2.86",POSITIVE,704.62,12800,ALIVE,NEGATIVE,Enterobacter cloacae,,NO,YES,NMV,0,NO,"S, 0.5",R,R,R,R,R,R,R,R,,,,,,,,,,,,R,,,ANKUR GUPTA
2001084552,53,M,SPUTUM,18,0,YES,NO,YES,YES,NO,NO,NO,10.88,"POSITIVE, 2.78",POSITIVE,1258.94,10400,ALIVE,NEGATIVE,K. pneumonniae,,NO,YES,NMV,0,NO,"S, 0.5",R,R,R,R,R,R,R,R,,,,,,,,,,,,MS,,,SUDHIR CHANDRA
2021321600,43,M,SPUTUM,5,0,NO,NO,NO,NO,NO,NO,NO,1.03,"POSITIVE, 2.97",POSITIVE,3376.28,8900,ALIVE,NEGATIVE,K. pneumonniae,R,NO,YES,NMV,0,NO,"S, 0.38",R,R,R,R,R,R,R,R,,,,,,,,,,,,MS,,,ANEESH AHUJA
2021293081,63,M,SPUTUM,5,0,YES,NO,NO,NO,NO,NO,NO,2.28,"POSITIVE, 2.2",POSITIVE,4526.19,20200,ALIVE,"Pseudo aero, s/t Ct",A. baumanii,R,NO,YES,NMV,0,NO,"S, 0.38",R,R,R,R,R,R,R,R,,,,,,,,,,,,R,,,RAM DHANI
2021313406,57,M,TT ASPIRATE,25,0,YES,NO,YES,NO,NO,NO,YES,9.46,"POSITIVE, 4.78",POSITIVE,867,9200,ALIVE,NEGATIVE,K. pneumonniae,R,YES,NO,NMV,0,NO,R,R,R,R,R,R,R,R,R,,,,,,,,,S,,,R,,,RAJA RAM
2012688519,69,M,SPUTUM,15,0,YES,NO,NO,NO,NO,NO,NO,0.08,"NEGATIVE, 0.28",POSITIVE,702,7100,ALIVE,NEGATIVE,A. baumanii,R,NO,YES,NMV,0,NO,"S, 0.75",R,R,R,R,R,R,R,R,,,,,,,,,,,,R,,,MOHD AFAQ
2008478858,54,F,SPUTUM,0,0,NO,YES,YES,NO,NO,NO,NO,0.39,,,1013.23,9200,ALIVE,NEGATIVE,E. coli,,B,NO,NMV,0,YES,,S,R,R,R,R,S,S,S,,,,,,,,,,,,,,,GURMEET KAUR
2021330121,37,M,SPUTUM,10,0,NO,NO,YES,NO,NO,NO,NO,0.49,"POSITIVE, 2.98",POSITIVE,2108,14400,ALIVE,NEGATIVE,Pseudomonas aeruginosa,,NO,NO,NMV,0,YES,"S, 2",R,S,,,MS,MS,R,,R,S,,MS,,,,,,,,,,,ABHAY TRIVEDI
2021308804,62,F,ET ASPIRATE,16,12,NO,NO,YES,YES,NO,NO,YES,20.91,"POSITIVE, 9.12",POSITIVE,1001.15,23000,DEAD,NEGATIVE,K. pneumonniae,R,NO,YES,MV,12,NO,"S, 1",R,R,R,R,R,R,R,R,,,,,,,,,,,,S,,,SHAMA AFROZ
2021288396,60,M,SPUTUM,0,0,YES,NO,NO,YES,NO,NO,NO,0.07,"NEGATIVE, 0.30",POSITIVE,1011.46,8700,ALIVE,NEGATIVE,K. pneumonniae,S,NO,NO,NMV,0,YES,S,S,S,S,S,S,S,S,S,,,,,,,,,,,,S,,,UDAY PRATAP SINGH
2021330647,47,M,SPUTUM,28,0,YES,NO,YES,NO,NO,NO,YES,13.14,"POSITIVE, 4.8",POSITIVE,2562,9000,ALIVE,"POS, Ochrobacterium anthropi",A. baumanii,R,NO,YES,NMV,0,NO,"S, 0.38",R,R,R,R,R,R,R,R,,,,,,,,,,,,R,,,JOGENDAR PAL DINKAR
2020226158,12,M,SPUTUM,0,0,NO,NO,YES,NO,NO,NO,NO,22.66,"POSITIVE, 5.6",POSITIVE,1689,3400,ALIVE,NEGATIVE,E. coli,R,NO,YES,NMV,0,NO,"S, 1",R,R,R,R,R,R,R,R,,,,,,,,,,,,R,,,VAIBHAV KUMAR
2021335612,51,M,SPUTUM,22,0,YES,NO,NO,YES,NO,NO,NO,0.05,"POSITIVE, 10.61",POSITIVE,1795,9300,ALIVE,NEGATIVE,K. pneumonniae,R,NO,YES,NMV,0,NO,"S, 0.38",R,R,R,R,R,R,R,R,,,,,,,,,,,,R,,,CHANDRA KANT KATIYAR
2020519108,29,F,SPUTUM,0,0,NO,NO,NO,NO,YES,NO,NO,,,,,7800,ALIVE,NEGATIVE,K. pneumonniae,S,NO,NO,NMV,0,YES,"S, 0.38",S,S,S,S,S,S,S,S,,,,,,,,,,,,S,,,RENU YADAV
2001264623,59,M,SPUTUM,20,0,NO,NO,NO,NO,NO,NO,NO,0.18,"POSITIVE, 3.34",POSITIVE,1315,10200,ALIVE,NEGATIVE,MSSA,,NO,NO,NMV,0,NO,,S,,,,,,,,,,,R,S,,S,R,,S,S,,,,AJAY AGARWAL
2012412939,52,M,SPUTUM,0,0,NO,YES,YES,NO,NO,NO,NO,0.41,"POSITIVE, 2.95",POSITIVE,1876,27500,ALIVE,NEGATIVE,Stenotrophomonas maltophilia,,NO,NO,NMV,0,YES,,,R,,,,,,,,,S,S,,,,,S,,,,,S,MAKSUDAN PRASAD SHAH
2021404458,50,M,SPUTUM,0,0,NO,YES,YES,NO,NO,YES,YES,35.4,"POSITIVE, 6.51",POSITIVE,2450.8,32900,ALIVE,NEGATIVE,K. pneumonniae,R,NO,YES,NMV,0,NO,"S, 0.19",R,R,R,R,R,R,R,R,,,,,,,,,,,,R,,,GAYASSUDIN
2021339898,44,F,ET ASPIRATE,10,9,YES,YES,NO,NO,NO,NO,NO,0.44,"POSITIVE, 4.84",POSITIVE,777,17900,DEAD,NEGATIVE,Pseudomonas aeruginosa,,NO,YES,MV,9,NO,"S, 0.5",R,R,,,R,R,R,,R,R,,R,,,,,,,,,,,SACHI TIWARI
2021340547,18,M,ET ASPIRATE,20,15,NO,NO,YES,NO,NO,YES,YES,20.34,"POSITIVE, 2.38",POSITIVE,400.23,26600,DEAD,"MRCONS, s/t T, Lz",Pseudomonas aeruginosa,,NO,YES,MV,15,NO,,R,R,,,R,R,R,,R,R,,R,,,,,,MS,,,,,MANU TIWARI
2012089771,62,F,TT ASPIRATE,24,17,NO,NO,NO,NO,NO,NO,YES,4.23,,,,18600,DEAD,NEGATIVE,Pseudomonas aeruginosa,,NO,NO,MV,17,YES,,S,R,,,S,S,S,,S,S,,S,,,,,,,,,,,NUTAN UPPAL
2021374253,52,F,BAL,41,20,NO,NO,NO,YES,NO,NO,YES,8.43,"POSITIVE, 6.92",,167.71,16000,ALIVE,"Chryseobacterium indologens, s/t Do, Mino, Cotri",Pseudomonas aeruginosa,,NO,YES,MV,20,NO,"S, 2",R,R,,,R,R,R,,R,R,,R,,,,,,,,,,,SHALINI AGARWAL
